Target
Serine protease 1
Ligand
BDBM13937
Substrate
BDBM12679
Meas. Tech.
Enzyme Assay and Determination of the Inhibition Constants
pH
7.72±n/a
Temperature
295.15±n/a K
Ki
3400±n/a nM
Comments
pH where Ki is lowest (pH(min)), and Ki(min) toward bovine trypsin.
Citation
 Katz, BAElrod, KVerner, EMackman, RLLuong, CShrader, WDSendzik, MSpencer, JRSprengeler, PAKolesnikov, ATai, VWHui, HCBreitenbucher, JGAllen, DJanc, JW Elaborate manifold of short hydrogen bond arrays mediating binding of active site-directed serine protease inhibitors. J Mol Biol 329:93-120 (2003)  
Target
Name:
Serine protease 1
Synonyms:
Beta-Trypsin PRSS1 TRY1 TRYP1 Trypsin I
Type:
Enzyme
Mol. Mass.:
25790.52
Organism:
Bos taurus (bovine)
Description:
P00760
Residue:
246
  
Inhibitor
Name:
BDBM13937
Synonyms:
2-(2-HYDROXY-PHENYL)-1H-BENZOIMIDAZOLE-5-CARBOXAMIDINE {amino[2-(2-hydroxyphenyl)-1H-1,3-benzodiazol-5-yl]methylidene}azanium
Type:
Small organic molecule
Emp. Form.:
C14H13N4O
Mol. Mass.:
253.2787
SMILES:
NC(=[NH2+])c1ccc2nc([nH]c2c1)-c1ccccc1O
:
Substrate
Name:
BDBM12679
Synonyms:
BDBM13790 Chromogenic Substrate
Type:
Small organic molecule
Emp. Form.:
C26H34N6O7S
Mol. Mass.:
574.649
SMILES:
Cc1ccc(cc1)S(=O)(=O)NCC(=O)N1CCCC1C(=O)NC(CCCCN)C(=O)Nc1ccc(cc1)[N+]([O-])=O
: