Target
Coagulation factor X
Ligand
BDBM13940
Substrate
BDBM13950
Meas. Tech.
Enzyme Assay and Determination of the Inhibition Constants
Ki
6900±n/a nM
Citation
 Katz, BAElrod, KVerner, EMackman, RLLuong, CShrader, WDSendzik, MSpencer, JRSprengeler, PAKolesnikov, ATai, VWHui, HCBreitenbucher, JGAllen, DJanc, JW Elaborate manifold of short hydrogen bond arrays mediating binding of active site-directed serine protease inhibitors. J Mol Biol 329:93-120 (2003)  
Target
Name:
Coagulation factor X
Synonyms:
Activated coagulation factor X (FXa) Coagulation factor X precursor F10 Factor X heavy chain Factor Xa Stuart-Prower factor
Type:
Enzyme
Mol. Mass.:
54726.60
Organism:
Homo sapiens (Human)
Description:
Residue:
488
  
Inhibitor
Name:
BDBM13940
Synonyms:
2-(3-HYDROXY-PYRIDIN-2-YL)-1H-BENZOIMIDAZOLE-5-CARBOXAMIDINE {amino[2-(3-hydroxypyridin-2-yl)-1H-1,3-benzodiazol-5-yl]methylidene}azanium
Type:
Small organic molecule
Emp. Form.:
C13H12N5O
Mol. Mass.:
254.2667
SMILES:
NC(=[NH2+])c1ccc2nc([nH]c2c1)-c1ncccc1O
:
Substrate
Name:
BDBM13950
Synonyms:
(2S)-N-({[(1S)-4-carbamimidamido-1-[(4-nitrophenyl)carbamoyl]butyl]carbamoyl}methyl)-2-acetamidohexanamide Factor Xa (fXa) Chromogenic Substrate
Type:
Emp. Form.:
Mol. Mass.:
SMILES:
: