Target
Retinal rod rhodopsin-sensitive cGMP 3',5'-cyclic phosphodiesterase subunit gamma
Ligand
BDBM14390
Substrate
BDBM14391
Meas. Tech.
PDE Enzyme Inhibitor Assays
pH
7.4±n/a
Temperature
303.15±n/a K
IC50
33±n/a nM
Comments
cGMP in a 3:1 ratio unlabeled to 3H-labeled at a concentration 1/3Km, such that IC50 = Ki.
Citation
 Allerton, CMBarber, CGBeaumont, KCBrown, DGCole, SMEllis, DLane, CAMaw, GNMount, NMRawson, DJRobinson, CMStreet, SDSummerhill, NW A novel series of potent and selective PDE5 inhibitors with potential for high and dose-independent oral bioavailability. J Med Chem 49:3581-94 (2006)  
Target
Name:
Retinal rod rhodopsin-sensitive cGMP 3',5'-cyclic phosphodiesterase subunit gamma
Synonyms:
CNRG_CANLF PDE6G Phosphodiesterase Type 6 (PDE6) | Retinal rod rhodopsin-sensitive cGMP 3 ,5 -cyclic phosphodiesterase subunit gamma
Type:
Enzyme
Mol. Mass.:
9656.12
Organism:
Canis lupus familiaris (Dog)
Description:
Residue:
87
  
Inhibitor
Name:
BDBM14390
Synonyms:
5-[2-ethoxy-5-(4-methyl-1-piperazinylsulfonyl)phenyl]-1-methyl-3-n-propyl-1,6-dihydro-7H-pyrazolo[4,3-d]pyrimidin-7-one CHEMBL192 Sildenafil US11155558, Compound sildenafil Viagra
Type:
Small organic molecule
Emp. Form.:
C22H30N6O4S
Mol. Mass.:
474.576
SMILES:
CCCc1nn(C)c2c1nc([nH]c2=O)-c1cc(ccc1OCC)S(=O)(=O)N1CCN(C)CC1
:
Substrate
Name:
BDBM14391
Synonyms:
2-amino-9-[(4aR,6R,7R,7aS)-2,7-dihydroxy-2-oxidotetrahydro-4H-furo[3,2-d][1,3,2]dioxaphosphinin-6-yl]-1,9-dihydro-6H-purin-6-one GUANOSINE-3 ,5 -MONOPHOSPHATE cGMP
Type:
Nucleoside or nucleotide
Emp. Form.:
C10H12N5O7P
Mol. Mass.:
345.2053
SMILES:
Nc1nc2n(cnc2c(=O)[nH]1)[C@@H]1O[C@@H]2COP(O)(=O)O[C@H]2[C@H]1O
: