Target
Tyrosine-protein kinase JAK1 [850-1154]
Ligand
BDBM349029
Substrate
Meas. Tech.
JAK1 Inhibition Assay
IC50
550±n/a nM
Citation
 Menet, CJVan Rompaey, LJFletcher, SRBlanc, JJouannigot, NHodges, AJSmits, KK Compounds useful for the treatment of degenerative and inflammatory diseases US Patent  US10206907 Publication Date 2/19/2019 
Target
Name:
Tyrosine-protein kinase JAK1 [850-1154]
Synonyms:
JAK1 JAK1A JAK1_HUMAN
Type:
Enzyme Catalytic Domain
Mol. Mass.:
34949.64
Organism:
Homo sapiens (Human)
Description:
P23458[850-1154]
Residue:
305
  
Inhibitor
Name:
BDBM349029
Synonyms:
N-(5-(4-(4- phenethylpiperidine-1- carbonyl(phenyl)- [1,2,4]triazolo[1,5-a]pyridin-2- yl)cyclopropanecarboxamide | US10206907, Compound 147
Type:
Small organic molecule
Emp. Form.:
C30H31N5O2
Mol. Mass.:
493.5994
SMILES:
O=C(Nc1nc2cccc(-c3ccc(cc3)C(=O)N3CCC(CCc4ccccc4)CC3)n2n1)C1CC1
: