Target
Sodium channel protein type 9 subunit alpha
Ligand
BDBM343090
Substrate
Meas. Tech.
In Vitro PX Assay
IC50
62.5±n/a nM
Citation
 Weiss, MDiMauro, EFDineen, TGraceffa, RGuzman-Perez, AHuang, HKreiman, CMarx, IENguyen, HNPeterson, EADeak, HL Bicyclic sulfonamide compounds as sodium channel inhibitors US Patent  US9776995 Publication Date 10/3/2017 
Target
Name:
Sodium channel protein type 9 subunit alpha
Synonyms:
NENA Peripheral sodium channel 1 SCN9A_HUMAN Voltage-gated sodium channel subunit Nav1.7 hNE-Na
Type:
Protein
Mol. Mass.:
226375.97
Organism:
Homo sapiens (Human)
Description:
Q15858
Residue:
1988
  
Inhibitor
Name:
BDBM343090
Synonyms:
N-3-isoxazolyl-4-(5-methoxy-2,2',4',5'-tetramethyl-4-biphenylyl)-7-quinazolinesulfonamide | US9776995, Example 262
Type:
Small organic molecule
Emp. Form.:
C28H26N4O4S
Mol. Mass.:
514.595
SMILES:
COc1cc(c(C)cc1-c1ncnc2cc(ccc12)S(=O)(=O)Nc1ccon1)-c1cc(C)c(C)cc1C
: