Target
Sodium channel protein type 9 subunit alpha
Ligand
BDBM343181
Substrate
Meas. Tech.
In Vitro PX Assay
IC50
89.0±n/a nM
Citation
 Weiss, MDiMauro, EFDineen, TGraceffa, RGuzman-Perez, AHuang, HKreiman, CMarx, IENguyen, HNPeterson, EADeak, HL Bicyclic sulfonamide compounds as sodium channel inhibitors US Patent  US9776995 Publication Date 10/3/2017 
Target
Name:
Sodium channel protein type 9 subunit alpha
Synonyms:
NENA Peripheral sodium channel 1 SCN9A_HUMAN Voltage-gated sodium channel subunit Nav1.7 hNE-Na
Type:
Protein
Mol. Mass.:
226375.97
Organism:
Homo sapiens (Human)
Description:
Q15858
Residue:
1988
  
Inhibitor
Name:
BDBM343181
Synonyms:
4-(2'-fluoro-5,5'-dimethoxy-2-methyl-4-biphenylyl)-N-3-isoxazolyl-7-quinazolinesulfonamide | US9776995, Example 561
Type:
Small organic molecule
Emp. Form.:
C26H21FN4O5S
Mol. Mass.:
520.532
SMILES:
COc1ccc(F)c(c1)-c1cc(OC)c(cc1C)-c1ncnc2cc(ccc12)S(=O)(=O)Nc1ccon1
: