Target
Coagulation factor VII
Ligand
BDBM14917
Substrate
BDBM13777
Meas. Tech.
Enzyme Inhibition Assay
Ki
66±n/a nM
Citation
 Shrader, WDKolesnikov, ABurgess-Henry, JRai, RHendrix, JHu, HTorkelson, STon, TYoung, WBKatz, BAYu, CTang, JCabuslay, RSanford, EJanc, JWSprengeler, PA Factor VIIa inhibitors: gaining selectivity within the trypsin family. Bioorg Med Chem Lett 16:1596-600 (2006)  
Target
Name:
Coagulation factor VII
Synonyms:
Eptacog alfa FA7_HUMAN Factor VIIa (fVIIa) SPCA serum prothrombin conversion accelerator
Type:
Enzyme
Mol. Mass.:
51599.89
Organism:
Homo sapiens (Human)
Description:
Residue:
466
  
Inhibitor
Name:
BDBM14917
Synonyms:
2-[3-(5-carbamimidoyl-1H-1,3-benzodiazol-2-yl)-5-(3-chlorophenyl)-4-hydroxyphenyl]butanedioic acid CHEMBL203055
Type:
Small organic molecule
Emp. Form.:
C24H19ClN4O5
Mol. Mass.:
478.884
SMILES:
NC(=N)c1ccc2nc([nH]c2c1)-c1cc(cc(-c2cccc(Cl)c2)c1O)C(CC(O)=O)C(O)=O
:
Substrate
Name:
BDBM13777
Synonyms:
(2S)-5-carbamimidamido-2-{2-[(2R)-3-cyclohexyl-2-methanesulfonamidopropanamido]butanamido}-N-(4-nitrophenyl)pentanamide; acetic acid Pefachrome FVIIa
Type:
Small organic molecule
Emp. Form.:
C26H42N8O7S
Mol. Mass.:
610.726
SMILES:
CCC(NC(=O)C(CC1CCCCC1)NS(C)(=O)=O)C(=O)NC(CCC\[NH+]=C(\N)[NH-])C(=O)Nc1ccc(cc1)[N+]([O-])=O
: