Target
Vascular endothelial growth factor receptor 2
Ligand
BDBM14950
Substrate
Gastrin Peptide Substrate
Meas. Tech.
Homogeneous Time-Resolved Fluorescence (HTRF) Enzyme Assay
IC50
2±n/a nM
Citation
 Cee, VJAlbrecht, BKGeuns-Meyer, SHughes, PBellon, SBready, JCaenepeel, SChaffee, SCCoxon, AEmery, MFretland, JGallant, PGu, YHodous, BLHoffman, DJohnson, REKendall, RKim, JLLong, AMMcGowan, DMorrison, MOlivieri, PRPatel, VFPolverino, APowers, DRose, PWang, LZhao, H Alkynylpyrimidine amide derivatives as potent, selective, and orally active inhibitors of Tie-2 kinase. J Med Chem 50:627-40 (2007)  
Target
Name:
Vascular endothelial growth factor receptor 2
Synonyms:
CD_antigen=CD309 Fetal liver kinase 1 (FLK-1) KDR Protein-tyrosine kinase receptor Flk-1 VEGFR-2 VEGFR2 Vascular Endothelial Growth Factor Receptor Kinase 2 Vascular endothelial growth factor receptor 2 (KDR) Vascular endothelial growth factor receptor 2 (VEGFR2) Vascular endothelial growth factor receptor-2 (VEGFR-2)
Type:
Receptor Tyrosine Kinase
Mol. Mass.:
151510.97
Organism:
Homo sapiens (Human)
Description:
P35968
Residue:
1356
  
Inhibitor
Name:
BDBM14950
Synonyms:
3-(2-(2-Aminopyrimidin-5-yl)ethynyl)-4-methyl-N-(3-(trifluoromethyl)phenyl)benzamide alkynylpyrimidine amide 6a
Type:
Small organic molecule
Emp. Form.:
C21H15F3N4O
Mol. Mass.:
396.3652
SMILES:
Cc1ccc(cc1C#Cc1cnc(N)nc1)C(=O)Nc1cccc(c1)C(F)(F)F
:
Substrate
Name:
Gastrin Peptide Substrate
Synonyms:
Biotinylated gastrin peptide substrate gastrin substrate
Type:
Peptide
Mol. Mass.:
1823.88
Organism:
Description:
Residue:
15
ITINEEEEAYGWLDF