Target
Tyrosine-protein kinase Lck [245-498]
Ligand
BDBM14969
Substrate
Gastrin Peptide Substrate
Meas. Tech.
Homogeneous Time-Resolved Fluorescence (HTRF) Enzyme Assay
IC50
1±n/a nM
Citation
 Cee, VJAlbrecht, BKGeuns-Meyer, SHughes, PBellon, SBready, JCaenepeel, SChaffee, SCCoxon, AEmery, MFretland, JGallant, PGu, YHodous, BLHoffman, DJohnson, REKendall, RKim, JLLong, AMMcGowan, DMorrison, MOlivieri, PRPatel, VFPolverino, APowers, DRose, PWang, LZhao, H Alkynylpyrimidine amide derivatives as potent, selective, and orally active inhibitors of Tie-2 kinase. J Med Chem 50:627-40 (2007)  
Target
Name:
Tyrosine-protein kinase Lck [245-498]
Synonyms:
LCK LSK Proto-oncogene tyrosine-protein kinase LCK p56-LCK
Type:
Kinase domain
Mol. Mass.:
29166.29
Organism:
Homo sapiens (Human)
Description:
Recombinant kinase domain (amino acid 245 to 498) fused with GST tag.
Residue:
254
  
Inhibitor
Name:
BDBM14969
Synonyms:
4-Methyl-3-(2-(quinolin-3-yl)ethynyl)-N-(3-(trifluoromethyl)-phenyl)benzamide heterocyclic akynyl amide 13d
Type:
Small organic molecule
Emp. Form.:
C26H17F3N2O
Mol. Mass.:
430.4212
SMILES:
Cc1ccc(cc1C#Cc1cnc2ccccc2c1)C(=O)Nc1cccc(c1)C(F)(F)F
:
Substrate
Name:
Gastrin Peptide Substrate
Synonyms:
Biotinylated gastrin peptide substrate gastrin substrate
Type:
Peptide
Mol. Mass.:
1823.88
Organism:
Description:
Residue:
15
ITINEEEEAYGWLDF