Target
Angiopoietin-1 receptor
Ligand
BDBM14985
Substrate
Her2 Peptide Substrate
Meas. Tech.
Homogeneous Time-Resolved Fluorescence (HTRF) Enzyme Assay
pH
7.5±n/a
Temperature
295.15±n/a K
IC50
22±n/a nM
Citation
 Hodous, BLGeuns-Meyer, SDHughes, PEAlbrecht, BKBellon, SBready, JCaenepeel, SCee, VJChaffee, SCCoxon, AEmery, MFretland, JGallant, PGu, YHoffman, DJohnson, REKendall, RKim, JLLong, AMMorrison, MOlivieri, PRPatel, VFPolverino, ARose, PTempest, PWang, LWhittington, DAZhao, H Evolution of a highly selective and potent 2-(pyridin-2-yl)-1,3,5-triazine Tie-2 kinase inhibitor. J Med Chem 50:611-26 (2007)  
Target
Name:
Angiopoietin-1 receptor
Synonyms:
TEK TIE2_HUMAN Tyrosine-protein kinase receptor (TIE-2) Tyrosine-protein kinase receptor TEK (p140 TEK) Tyrosine-protein kinase receptor TIE2/TEK VMCM1 p140 TEK
Type:
Enzyme
Mol. Mass.:
125835.70
Organism:
Homo sapiens (Human)
Description:
Q02763
Residue:
1124
  
Inhibitor
Name:
BDBM14985
Synonyms:
N-(5-Cyclohexyl-2-methoxyphenyl)-4-methyl-3-(3-(4-(methylamino)-1,3,5-triazin-2-yl)pyridin-2-yloxy)benzamide triazine analog 24
Type:
Small organic molecule
Emp. Form.:
C30H32N6O3
Mol. Mass.:
524.6135
SMILES:
CNc1ncnc(n1)-c1cccnc1Oc1cc(ccc1C)C(=O)Nc1cc(ccc1OC)C1CCCCC1
:
Substrate
Name:
Her2 Peptide Substrate
Synonyms:
Biotinylated Her2 Peptide Substrate | biotinylated long chain peptide
Type:
Peptide
Mol. Mass.:
2278.65
Organism:
Description:
Residue:
20