Target
Vascular endothelial growth factor receptor 2
Ligand
BDBM14973
Substrate
Gastrin Peptide Substrate
Meas. Tech.
Homogeneous Time-Resolved Fluorescence (HTRF) Enzyme Assay
IC50
177±n/a nM
Citation
 Hodous, BLGeuns-Meyer, SDHughes, PEAlbrecht, BKBellon, SBready, JCaenepeel, SCee, VJChaffee, SCCoxon, AEmery, MFretland, JGallant, PGu, YHoffman, DJohnson, REKendall, RKim, JLLong, AMMorrison, MOlivieri, PRPatel, VFPolverino, ARose, PTempest, PWang, LWhittington, DAZhao, H Evolution of a highly selective and potent 2-(pyridin-2-yl)-1,3,5-triazine Tie-2 kinase inhibitor. J Med Chem 50:611-26 (2007)  
Target
Name:
Vascular endothelial growth factor receptor 2
Synonyms:
CD_antigen=CD309 Fetal liver kinase 1 (FLK-1) KDR Protein-tyrosine kinase receptor Flk-1 VEGFR-2 VEGFR2 Vascular Endothelial Growth Factor Receptor Kinase 2 Vascular endothelial growth factor receptor 2 (KDR) Vascular endothelial growth factor receptor 2 (VEGFR2) Vascular endothelial growth factor receptor-2 (VEGFR-2)
Type:
Receptor Tyrosine Kinase
Mol. Mass.:
151510.97
Organism:
Homo sapiens (Human)
Description:
P35968
Residue:
1356
  
Inhibitor
Name:
BDBM14973
Synonyms:
4-Methyl-3-(3-(pyrimidin-4-yl)pyridin-2-ylamino)-N-(4-(trifluoromethyl)phenyl)benzamide pyridinyl pyrimidine 38
Type:
Small organic molecule
Emp. Form.:
C24H18F3N5O
Mol. Mass.:
449.4278
SMILES:
Cc1ccc(cc1Nc1ncccc1-c1ccncn1)C(=O)Nc1ccc(cc1)C(F)(F)F
:
Substrate
Name:
Gastrin Peptide Substrate
Synonyms:
Biotinylated gastrin peptide substrate gastrin substrate
Type:
Peptide
Mol. Mass.:
1823.88
Organism:
Description:
Residue:
15
ITINEEEEAYGWLDF