Target
E3 ubiquitin-protein ligase Mdm2 [17-125]
Ligand
BDBM223402
Substrate
Meas. Tech.
FRET Assay
Temperature
298.15±n/a K
IC50
0.3806±n/a nM
Comments
extracted
Citation
 Cammarano, CMChristopher, MPDinsmore, CDoll, RJFradera Llinas, FXLi, CMachacek, MMartinez, MNair, LGPan, WReutershan, MHShizuka, MSteinhuebel, DPSun, BThompson, CFTrotter, BWWang, YYang, LBogen, SLVoss, MEPanda, JKurissery, AT 2,6,7,8 substituted purines as HDM2 inhibitors US Patent  US9540377 Publication Date 1/10/2017 
Target
Name:
E3 ubiquitin-protein ligase Mdm2 [17-125]
Synonyms:
Double minute 2 protein MDM2 p53-binding protein Mdm2
Type:
Enzyme Catalytic Domain
Mol. Mass.:
12522.24
Organism:
Homo sapiens (Human)
Description:
Residue 17 to 125
Residue:
109
  
Inhibitor
Name:
BDBM223402
Synonyms:
6-{[(1r)-1- cyclobutylethyl]amino}- 7-[(trans-4- methylcyclohexyl) methyl]-8-[(2s)-2- phenylpiperidin-1- yl]-7h-purine-2- carboxylic acid | US9540377, 11.14
Type:
Small organic molecule
Emp. Form.:
C31H42N6O2
Mol. Mass.:
530.7042
SMILES:
C[C@@H](Nc1nc(nc2nc(N3CCCC[C@H]3c3ccccc3)n(C[C@H]3CC[C@H](C)CC3)c12)C(O)=O)C1CCC1
: