Target
E3 ubiquitin-protein ligase Mdm2 [17-125]
Ligand
BDBM226428
Substrate
Meas. Tech.
FRET Assay
Temperature
298.15±n/a K
IC50
0.424±n/a nM
Comments
extracted
Citation
 Cammarano, CMChristopher, MPDinsmore, CDoll, RJFradera Llinas, FXLi, CMachacek, MMartinez, MNair, LGPan, WReutershan, MHShizuka, MSteinhuebel, DPSun, BThompson, CFTrotter, BWWang, YYang, LBogen, SLVoss, MEPanda, JKurissery, AT 2,6,7,8 substituted purines as HDM2 inhibitors US Patent  US9540377 Publication Date 1/10/2017 
Target
Name:
E3 ubiquitin-protein ligase Mdm2 [17-125]
Synonyms:
Double minute 2 protein MDM2 p53-binding protein Mdm2
Type:
Enzyme Catalytic Domain
Mol. Mass.:
12522.24
Organism:
Homo sapiens (Human)
Description:
Residue 17 to 125
Residue:
109
  
Inhibitor
Name:
BDBM226428
Synonyms:
3-{6-(5-chloropyridin-3- yl)-8-[1-fluoro-1-(2- fluorophenyl)ethyl]-7- [(trans-4- methylcyclohexyl)methyl]- 7h-purin-2-yl}-1,2,4- oxadiazol-5(4h)-one (enantiomer 1) US9540377, 23.35
Type:
Small organic molecule
Emp. Form.:
C28H26ClF2N7O2
Mol. Mass.:
566.002
SMILES:
C[C@H]1CC[C@H](Cn2c(nc3nc(nc(-c4cncc(Cl)c4)c23)-c2noc(=O)[nH]2)C(C)(F)c2ccccc2F)CC1
: