Target
Interleukin-1 receptor-associated kinase 1 [194-712]
Ligand
BDBM347995
Substrate
Meas. Tech.
Enzymatic Assay
IC50
3000±n/a nM
Citation
 Jorand-Lebrun, CJones, RWon, ACNguyen, NJohnson, TLDeselm, LCPanda, K Heteroaryl compounds as IRAK inhibitors and uses thereof US Patent  US9790221 Publication Date 10/17/2017 
Target
Name:
Interleukin-1 receptor-associated kinase 1 [194-712]
Synonyms:
IRAK IRAK1_HUMAN | Interleukin-1 receptor-associated kinase 1 (IRAK1)
Type:
Enzyme Catalytic Domain
Mol. Mass.:
55943.99
Organism:
Homo sapiens (Human)
Description:
aa 194-712
Residue:
519
  
Inhibitor
Name:
BDBM347995
Synonyms:
US9790221, Compound 201
Type:
Small organic molecule
Emp. Form.:
C26H32N8O2S
Mol. Mass.:
520.65
SMILES:
Cn1cc(cn1)-c1cccc(c1)-c1ncc(-c2cnn(C)c2)c(NC2CCC(CNS(C)(=O)=O)CC2)n1
: