Target
Phosphatidylinositol 3-kinase regulatory subunit alpha
Ligand
BDBM348085
Substrate
Meas. Tech.
Inhibition Assay
IC50
>1000±n/a nM
Citation
 Ren, PLiu, YLi, LChan, KWilson, TE Heterocyclic kinase inhibitors US Patent  US9790228 Publication Date 10/17/2017 
Target
Name:
Phosphatidylinositol 3-kinase regulatory subunit alpha
Synonyms:
GRB1 PI3-kinase class I PI3-kinase p85-alpha subunit PI3-kinase subunit p85-alpha PIK3CG/PIK3R1 Phosphatidylinositol 3-kinase 85 kDa regulatory subunit alpha (PI3K alpha) Phosphatidylinositol 3-kinase regulatory subunit alpha (PIK3R1) Phosphatidylinositol 3-kinase regulatory subunit alpha isoform 1 (PI3 Kinase alpha) Phosphatidylinositol 4,5-bisphosphate 3-kinase catalytic subunit alpha isoform (PI3Kalpha) PtdIns-3-kinase p85-alpha p85 alpha
Type:
Protein
Mol. Mass.:
83592.82
Organism:
Homo sapiens (Human)
Description:
P27986
Residue:
724
  
Inhibitor
Name:
BDBM348085
Synonyms:
US9790228, Compound 4
Type:
Small organic molecule
Emp. Form.:
C28H21FN6O
Mol. Mass.:
476.5043
SMILES:
Cc1ccccc1-c1nc2ccccc2cc1Cn1nc(-c2cc(O)cc(F)c2)c2c(N)ncnc12
: