Target
G-protein coupled estrogen receptor 1
Ligand
BDBM349626
Substrate
Meas. Tech.
Estrogen Receptor (ER) Degradation Assay
IC50
<1000±n/a nM
Citation
 Strum, JC Benzothiophene estrogen receptor modulators US Patent  US10208011 Publication Date 2/19/2019 
Target
Name:
G-protein coupled estrogen receptor 1
Synonyms:
CEPR DRY12 G-protein-coupled receptor (GPR30 ) GPER1 GPR30
Type:
PROTEIN
Mol. Mass.:
42259.21
Organism:
Homo sapiens (Human)
Description:
ChEMBL_982507
Residue:
375
  
Inhibitor
Name:
BDBM349626
Synonyms:
(4-f1uoro-2,6-dimethylphenyl)(3-(4-(2- (3-(fluoromethyl)azetidin-1- yl)ethoxy)phenyl)-6- hydroxybenzo[b]thiophen-2- yl)methanone US10981887, Compound 120
Type:
Small organic molecule
Emp. Form.:
C29H27F2NO3S
Mol. Mass.:
507.591
SMILES:
Cc1cc(F)cc(C)c1C(=O)c1sc2cc(O)ccc2c1-c1ccc(OCCN2CC(CF)C2)cc1
: