Target
Mitogen-activated protein kinase 9
Ligand
BDBM15915
Substrate
biotinylated GST-ATF2
Meas. Tech.
ATF-2 Phosphorylation Assay
IC50
41±n/a nM
Citation
 Zhao, HSerby, MDXin, ZSzczepankiewicz, BGLiu, MKosogof, CLiu, BNelson, LTJohnson, EFWang, SPederson, TGum, RJClampit, JEHaasch, DLAbad-Zapatero, CFry, EHRondinone, CTrevillyan, JMSham, HLLiu, G Discovery of potent, highly selective, and orally bioavailable pyridine carboxamide c-Jun NH2-terminal kinase inhibitors. J Med Chem 49:4455-8 (2006)  
Target
Name:
Mitogen-activated protein kinase 9
Synonyms:
JNK-55 JNK2/JNK3 MK09_HUMAN Mitogen-activated protein kinase 8/9 SAPK1A c-Jun N-terminal kinase 2 | c-Jun N-terminal kinase 2 (JNK2)
Type:
Enzyme
Mol. Mass.:
48131.49
Organism:
Homo sapiens (Human)
Description:
JNK-2 was purchased from Upstate Cell Signaling Solutions (formerly Upstate Biotechnology).
Residue:
424
  
Inhibitor
Name:
BDBM15915
Synonyms:
2-pyridinecarboxamide deriv. 8e 4-amino-5-cyano-6-ethoxy-N-(pyridin-3-ylmethyl)pyridine-2-carboxamide
Type:
Small organic molecule
Emp. Form.:
C15H15N5O2
Mol. Mass.:
297.3119
SMILES:
CCOc1nc(cc(N)c1C#N)C(=O)NCc1cccnc1
:
Substrate
Name:
biotinylated GST-ATF2
Synonyms:
ATF-2-GST Activating transcription factor 2 GST-ATF2 biotinylated activating transcription factor 2
Type:
Other Protein Type
Mol. Mass.:
12237.77
Organism:
Homo sapiens (Human)
Description:
Residue:
109