Target
Dihydroorotate dehydrogenase (quinone), mitochondrial
Ligand
BDBM16097
Substrate
BDBM14700
Meas. Tech.
DHODH Inhibition Assay
pH
8±n/a
Temperature
298.15±n/a K
IC50
>200000±n/a nM
Km
15000±n/a nM
Citation
 Heikkila, TThirumalairajan, SDavies, MParsons, MRMcConkey, AGFishwick, CWJohnson, AP The first de novo designed inhibitors of Plasmodium falciparum dihydroorotate dehydrogenase. Bioorg Med Chem Lett 16:88-92 (2006)  
Target
Name:
Dihydroorotate dehydrogenase (quinone), mitochondrial
Synonyms:
DHODH Dihydroorotate dehydrogenase Dihydroorotate dehydrogenase, mitochondrial Dihydroorotate oxidase (DHODH) | PYRD_HUMAN
Type:
Enzyme
Mol. Mass.:
42881.33
Organism:
Homo sapiens (Human)
Description:
Q02127
Residue:
395
  
Inhibitor
Name:
BDBM16097
Synonyms:
2-[methyl(naphthalen-2-ylcarbonyl)amino]benzoic acid Inhibitor 5
Type:
Small organic molecule
Emp. Form.:
C19H15NO3
Mol. Mass.:
305.3273
SMILES:
CN(C(=O)c1ccc2ccccc2c1)c1ccccc1C(O)=O
:
Substrate
Name:
BDBM14700
Synonyms:
2,3-dimethoxy-5-methyl-6-decyl-1,4-benzoquinone Decylubiquinone
Type:
Ubiquinone analog
Emp. Form.:
C19H30O4
Mol. Mass.:
322.4391
SMILES:
CCCCCCCCC=Cc1c(C)c(O)c(OC)c(OC)c1O
: