Target
Urokinase-type plasminogen activator
Ligand
BDBM16127
Substrate
BDBM14716
Meas. Tech.
Determination of Inhibitor Potency and Selectivity
pH
8.1±n/a
Temperature
310.15±n/a K
Ki
2300±n/a nM
Km
90000±n/a nM
Citation
 Fish, PVBarber, CGBrown, DGButt, RCollis, MGDickinson, RPHenry, BTHorne, VAHuggins, JPKing, EO'gara, MMcCleverty, DMcIntosh, FPhillips, CWebster, R Selective Urokinase-Type Plasminogen Activator Inhibitors. 4. 1-(7-Sulfonamidoisoquinolinyl)guanidines. J Med Chem 50:2341-51 (2007)  
Target
Name:
Urokinase-type plasminogen activator
Synonyms:
PLAU UROK_HUMAN Urokinase-type plasminogen activator (uPA) | Urokinase-type plasminogen activator/surface receptor
Type:
Enzyme
Mol. Mass.:
48528.62
Organism:
Homo sapiens (Human)
Description:
P00749
Residue:
431
  
Inhibitor
Name:
BDBM16127
Synonyms:
2,2 -methanediylbis(1H-benzimidazole-6-carboximidamide) AIDS007118 CHEMBL542712 | CHEMBL99951
Type:
Small organic molecule
Emp. Form.:
C17H16N8
Mol. Mass.:
332.3625
SMILES:
NC(=N)c1ccc2nc(Cc3nc4ccc(cc4[nH]3)C(N)=N)[nH]c2c1
:
Substrate
Name:
BDBM14716
Synonyms:
(2S)-5-carbamimidamido-N-(4-nitrophenyl)-2-(2-{[(2S)-5-oxopyrrolidin-2-yl]formamido}acetamido)pentanamide hydrochloride L-Pyroglutamyl-glycyl-L-argininep-Nitroaniline hydrochloride
Type:
Small organic molecule
Emp. Form.:
C19H26N8O6
Mol. Mass.:
462.4597
SMILES:
[#7]\[#6](-[#7])=[#7]/[#6]-[#6]-[#6]-[#6@H](-[#7]-[#6](=O)-[#6]-[#7]-[#6](=O)-[#6@@H]-1-[#6]-[#6]-[#6](=O)-[#7]-1)-[#6](=O)-[#7]-c1ccc(cc1)-[#7+](-[#8-])=O
: