Target
Serine protease 1
Ligand
BDBM16175
Substrate
BDBM12774
Meas. Tech.
Determination of Inhibition Constants
pH
8±n/a
Temperature
298.15±n/a K
Ki
37±n/a nM
Citation
 Zeslawska, ESchweinitz, AKarcher, ASondermann, PSperl, SSturzebecher, JJacob, U Crystals of the urokinase type plasminogen activator variant beta(c)-uPAin complex with small molecule inhibitors open the way towards structure-based drug design. J Mol Biol 301:465-75 (2000)  
Target
Name:
Serine protease 1
Synonyms:
Beta-Trypsin PRSS1 TRY1 TRYP1 Trypsin I
Type:
Enzyme
Mol. Mass.:
25790.52
Organism:
Bos taurus (bovine)
Description:
P00760
Residue:
246
  
Inhibitor
Name:
BDBM16175
Synonyms:
CHEMBL108468 ethyl 4-(3-carbamimidoyl-N-{[2,4,6-tris(1-methylethyl)phenyl]sulfonyl}phenylalanyl)piperazine-1-carboxylate | ethyl 4-[3-(3-carbamimidoylphenyl)-2-{[2,4,6-tris(propan-2-yl)benzene]sulfonamido}propanoyl]piperazine-1-carboxylate
Type:
Small organic molecule
Emp. Form.:
C32H47N5O5S
Mol. Mass.:
613.811
SMILES:
CCOC(=O)N1CCN(CC1)C(=O)C(Cc1cccc(c1)C(N)=N)NS(=O)(=O)c1c(cc(cc1C(C)C)C(C)C)C(C)C
:
Substrate
Name:
BDBM12774
Synonyms:
(2S)-5-carbamimidamido-2-{2-[(2R)-3-(4-hydroxycyclohexyl)-2-methanesulfonamidopropanamido]acetamido}-N-(4-nitrophenyl)pentanamide; acetic acid Factor IX Chromogenic Substrate Methylsulfonyl-D-hexahydrotyrosyl-glycyl-arginine-4-nitroanilide Spectrozyme tPA | tPA/Trypsin Substrate
Type:
Small organic molecule
Emp. Form.:
C24H38N8O8S
Mol. Mass.:
598.672
SMILES:
CS(=O)(=O)NC(CC1CCC(O)CC1)C(=O)NCC(=O)NC(CCC\[NH+]=C(\N)[NH-])C(=O)Nc1ccc(cc1)[N+]([O-])=O
: