Target
Chymotrypsin-C
Ligand
BDBM16127
Substrate
BDBM16302
Meas. Tech.
Enzyme Inhibition Assay
Ki
710000±n/a nM
Citation
 Katz, BAClark, JMFiner-Moore, JSJenkins, TEJohnson, CRRoss, MJLuong, CMoore, WRStroud, RM Design of potent selective zinc-mediated serine protease inhibitors. Nature 391:608-12 (1998)  
Target
Name:
Chymotrypsin-C
Synonyms:
CLCR CTRC_HUMAN Chymotrypsin Chymotrypsin-C
Type:
Enzyme
Mol. Mass.:
29487.98
Organism:
Homo sapiens (Human)
Description:
Q99895
Residue:
268
  
Inhibitor
Name:
BDBM16127
Synonyms:
2,2 -methanediylbis(1H-benzimidazole-6-carboximidamide) AIDS007118 CHEMBL542712 | CHEMBL99951
Type:
Small organic molecule
Emp. Form.:
C17H16N8
Mol. Mass.:
332.3625
SMILES:
NC(=N)c1ccc2nc(Cc3nc4ccc(cc4[nH]3)C(N)=N)[nH]c2c1
:
Substrate
Name:
BDBM16302
Synonyms:
Chymase/Chymotrypsin Chromogenic Substrate | Suc-Val-Pro-Phe-SBzl
Type:
Small organic molecule
Emp. Form.:
C30H37N3O6S
Mol. Mass.:
567.696
SMILES:
CC(C)[C@H](NC(=O)CCC(O)=O)C(=O)N1CCC[C@H]1C(=O)N[C@@H](Cc1ccccc1)C(=O)SCc1ccccc1
: