Target
Tyrosine-protein kinase BTK
Ligand
BDBM351756
Substrate
Meas. Tech.
Fluorescence Polarization-Based Kinase Assay
Ki
<100±n/a nM
Citation
 Laurent, ARose, YJaquith, JB Selective inhibitors of Tec and Src protein kinase families US Patent  US9796716 Publication Date 10/24/2017 
Target
Name:
Tyrosine-protein kinase BTK
Synonyms:
AGMX1 Agammaglobulinaemia tyrosine kinase B cell progenitor kinase BPK BTK_HUMAN Tyrosine Kinase BTK Tyrosine-protein kinase BTK (BTK)
Type:
Enzyme
Mol. Mass.:
76289.95
Organism:
Homo sapiens (Human)
Description:
Q06187
Residue:
659
  
Inhibitor
Name:
BDBM351756
Synonyms:
US9796716, Compound 2
Type:
Small organic molecule
Emp. Form.:
C29H27N5O2
Mol. Mass.:
477.557
SMILES:
Nc1ncnc2n(nc(-c3ccc(Oc4cccc(OCc5ccccc5)c4)cc3)c12)C1CCCC1
: