Target
Tyrosine-protein kinase BTK
Ligand
BDBM351793
Substrate
Meas. Tech.
Fluorescence Polarization-Based Kinase Assay
Ki
<100±n/a nM
Citation
 Laurent, ARose, YJaquith, JB Selective inhibitors of Tec and Src protein kinase families US Patent  US9796716 Publication Date 10/24/2017 
Target
Name:
Tyrosine-protein kinase BTK
Synonyms:
AGMX1 Agammaglobulinaemia tyrosine kinase B cell progenitor kinase BPK BTK_HUMAN Tyrosine Kinase BTK Tyrosine-protein kinase BTK (BTK)
Type:
Enzyme
Mol. Mass.:
76289.95
Organism:
Homo sapiens (Human)
Description:
Q06187
Residue:
659
  
Inhibitor
Name:
BDBM351793
Synonyms:
US9796716, Compound 37
Type:
Small organic molecule
Emp. Form.:
C27H26N6O2S
Mol. Mass.:
498.599
SMILES:
Cc1ncc(COc2cccc(Oc3ccc(cc3)-c3nn(C4CCCC4)c4ncnc(N)c34)c2)s1
: