Target
Carbonic anhydrase 5A, mitochondrial
Ligand
BDBM10870
Substrate
BDBM10856
Meas. Tech.
Esterase Assay
Ki
6±n/a nM
Citation
 Vullo, DFranchi, MGallori, EAntel, JScozzafava, ASupuran, CT Carbonic anhydrase inhibitors. Inhibition of mitochondrial isozyme V with aromatic and heterocyclic sulfonamides. J Med Chem 47:1272-9 (2004)  
Target
Name:
Carbonic anhydrase 5A, mitochondrial
Synonyms:
CAH5A_MOUSE Ca5a Car5a Carbonic Anhydrase V Carbonic anhydrase 5A, mitochondrial precursor
Type:
Enzyme
Mol. Mass.:
34081.17
Organism:
Mus musculus (mouse)
Description:
Full length murine, cloned isozyme.
Residue:
299
  
Inhibitor
Name:
BDBM10870
Synonyms:
2-N-(4-aminobenzene)-1,3,4-thiadiazole-2,5-disulfonamide CHEMBL268439 aminobenzolamide deriv. 43 | aromatic/heteroaromatic sulfonamide 15
Type:
Small organic molecule
Emp. Form.:
C8H9N5O4S3
Mol. Mass.:
335.383
SMILES:
Nc1ccc(cc1)S(=O)(=O)Nc1nnc(s1)S(N)(=O)=O
:
Substrate
Name:
BDBM10856
Synonyms:
Carbon Dioxide | methanedione
Type:
Small organic molecule
Emp. Form.:
CO2
Mol. Mass.:
44.0095
SMILES:
O=C=O
: