Target
Beta-secretase 1
Ligand
BDBM16757
Substrate
MBPAPPC125
Meas. Tech.
BACE Enzyme Inhibition Assay
pH
4.8±n/a
Temperature
310.15±n/a K
IC50
310±n/a nM
Citation
 Hom, RKGailunas, AFMamo, SFang, LYTung, JSWalker, DEDavis, DThorsett, EDJewett, NEMoon, JBJohn, V Design and synthesis of hydroxyethylene-based peptidomimetic inhibitors of human beta-secretase. J Med Chem 47:158-64 (2004)  
Target
Name:
Beta-secretase 1
Synonyms:
ASP2 Aspartyl protease 2 BACE1 Beta-secretase (BACE) Beta-secretase 1 (BACE 1) Beta-secretase 1 (BACE1) Beta-site amyloid precursor protein cleaving enzyme 1 Memapsin-2 beta-Secretase (BACE-1) | beta-Secretase (BACE1)
Type:
Protein
Mol. Mass.:
55755.10
Organism:
Homo sapiens (Human)
Description:
P56817
Residue:
501
  
Inhibitor
Name:
BDBM16757
Synonyms:
4-[(2R,4S,5S)-6-(3,5-difluorophenyl)-5-{[3-(dipropylcarbamoyl)phenyl]formamido}-2-ethyl-4-hydroxyhexanamido]butanoic acid | Hydroxyethylene-Based Peptidomimetic Inhibitor, 7
Type:
Small organic molecule
Emp. Form.:
C32H43F2N3O6
Mol. Mass.:
603.6971
SMILES:
CCCN(CCC)C(=O)c1cccc(c1)C(=O)N[C@@H](Cc1cc(F)cc(F)c1)[C@@H](O)C[C@@H](CC)C(=O)NCCCC(O)=O
:
Substrate
Name:
MBPAPPC125
Synonyms:
A4 AD1 MBP-C125
Type:
Other Protein Type
Mol. Mass.:
13932.72
Organism:
Homo sapiens (Human)
Description:
It is the fusion protein containing the maltose-binding protein at the N-terminal end connected to the carboxyl-terminal 125 amino acids of APP (amyloid precursor protein).
Residue:
125