Target
Integrin alpha-4/beta-7
Ligand
BDBM16818
Substrate
MAdCAM-1
Meas. Tech.
Ramos Cell Adhesion Assay (alpha4beta1 Mediated Adhesion/VCAM-1)
Temperature
277.15±n/a K
IC50
3±n/a nM
Comments
extracted
Citation
 Gong, YBarbay, JKDyatkin, ABMiskowski, TAKimball, ESProuty, SMFisher, MCSantulli, RJSchneider, CRWallace, NHBallentine, SAHageman, WEMasucci, JAMaryanoff, BEDamiano, BPAndrade-Gordon, PHlasta, DJHornby, PJHe, W Synthesis and biological evaluation of novel pyridazinone-based alpha4 integrin receptor antagonists. J Med Chem 49:3402-11 (2006)  
Target
Name:
Integrin alpha-4/beta-7
Synonyms:
Integrin α4β7 Integrin alpha-4/beta7 | Integrin alpha4beta7
Type:
Protein Complex
Mol. Mass.:
Description:
The assay uses stably transfected K562 cells expressing human alpha4beta7 integrin.
Components:
This complex has 2 components.
Component 1
Name:
Integrin alpha-4
Synonyms:
CD49 antigen-like family member D CD49d antigen ITA4_HUMAN Integrin alpha-4 Integrin alpha-IV VLA-4 integrin alpha 4 precursor | integrin alpha-4 precursor
Type:
Membrane Protein
Mol. Mass.:
114897.35
Organism:
Homo sapiens (Human)
Description:
P13612
Residue:
1032
  
Component 2
Name:
Integrin beta-7
Synonyms:
ITB7_HUMAN Integrin alpha-4/beta-7 Integrin beta7
Type:
Membrane Protein
Mol. Mass.:
86893.88
Organism:
Homo sapiens (Human)
Description:
P26010
Residue:
798
  
Inhibitor
Name:
BDBM16818
Synonyms:
(2S)-2-[(2,6-dichlorophenyl)formamido]-3-(4-{2-methyl-5-[2-(morpholin-4-yl)ethoxy]-3-oxo-2,3-dihydropyridazin-4-yl}phenyl)propanoic acid pyridazinone-based antagonist, 20
Type:
Small organic molecule
Emp. Form.:
C27H28Cl2N4O6
Mol. Mass.:
575.44
SMILES:
Cn1ncc(OCCN2CCOCC2)c(-c2ccc(C[C@H](NC(=O)c3c(Cl)cccc3Cl)C(O)=O)cc2)c1=O
:
Substrate
Name:
MAdCAM-1
Synonyms:
Mucosal addressin cell adhesion molecule 1 | hMAdCAM-1
Type:
Other Protein Type
Mol. Mass.:
42675.21
Organism:
Homo sapiens (Human)
Description:
Recombinant FLAG-hMAdCAM-1.
Residue:
406