Target
Integrin alpha-4/beta-7
Ligand
BDBM16820
Substrate
MAdCAM-1
Meas. Tech.
Ramos Cell Adhesion Assay (alpha4beta1 Mediated Adhesion/VCAM-1)
Temperature
277.15±n/a K
IC50
63±n/a nM
Comments
extracted
Citation
 Gong, YBarbay, JKDyatkin, ABMiskowski, TAKimball, ESProuty, SMFisher, MCSantulli, RJSchneider, CRWallace, NHBallentine, SAHageman, WEMasucci, JAMaryanoff, BEDamiano, BPAndrade-Gordon, PHlasta, DJHornby, PJHe, W Synthesis and biological evaluation of novel pyridazinone-based alpha4 integrin receptor antagonists. J Med Chem 49:3402-11 (2006)  
Target
Name:
Integrin alpha-4/beta-7
Synonyms:
Integrin α4β7 Integrin alpha-4/beta7 | Integrin alpha4beta7
Type:
Protein Complex
Mol. Mass.:
Description:
The assay uses stably transfected K562 cells expressing human alpha4beta7 integrin.
Components:
This complex has 2 components.
Component 1
Name:
Integrin alpha-4
Synonyms:
CD49 antigen-like family member D CD49d antigen ITA4_HUMAN Integrin alpha-4 Integrin alpha-IV VLA-4 integrin alpha 4 precursor | integrin alpha-4 precursor
Type:
Membrane Protein
Mol. Mass.:
114897.35
Organism:
Homo sapiens (Human)
Description:
P13612
Residue:
1032
  
Component 2
Name:
Integrin beta-7
Synonyms:
ITB7_HUMAN Integrin alpha-4/beta-7 Integrin beta7
Type:
Membrane Protein
Mol. Mass.:
86893.88
Organism:
Homo sapiens (Human)
Description:
P26010
Residue:
798
  
Inhibitor
Name:
BDBM16820
Synonyms:
(2S)-3-[4-(5-methoxy-2-methyl-3-oxo-2,3-dihydropyridazin-4-yl)phenyl]-2-{[methyl(phenyl)carbamoyl]amino}propanoic acid | pyridazinone-based antagonist, 25
Type:
Small organic molecule
Emp. Form.:
C23H24N4O5
Mol. Mass.:
436.4605
SMILES:
COc1cnn(C)c(=O)c1-c1ccc(C[C@H](NC(=O)N(C)c2ccccc2)C(O)=O)cc1
:
Substrate
Name:
MAdCAM-1
Synonyms:
Mucosal addressin cell adhesion molecule 1 | hMAdCAM-1
Type:
Other Protein Type
Mol. Mass.:
42675.21
Organism:
Homo sapiens (Human)
Description:
Recombinant FLAG-hMAdCAM-1.
Residue:
406