Target
Estrogen receptor beta
Ligand
BDBM158504
Substrate
Estrogen receptor beta
Meas. Tech.
In Vitro Assay
pH
7.5±n/a
Ki
0.025±n/a nM
Comments
extracted
Citation
 Coelingh Bennink, HJBunschoten, EJ Pharmaceutical compositions comprising estetrol derivatives for use in cancer therapy US Patent  US9561238 Publication Date 2/7/2017 
Target
Name:
Estrogen receptor beta
Synonyms:
ER-beta ESR2_HUMAN Estradiol receptor beta (ERβ) Estrogen receptor (ER beta) Estrogen receptor beta (ER beta) NR3A2 estrogen beta
Type:
Protein
Mol. Mass.:
59238.43
Organism:
Homo sapiens (Human)
Description:
Q92731
Residue:
530
  
Inhibitor
Name:
BDBM158504
Synonyms:
US9034854, EE US9561238, EE
Type:
Small organic molecule
Emp. Form.:
C20H24O2
Mol. Mass.:
296.4034
SMILES:
CC12CC[C@H]3[C@@H](CCc4cc(O)ccc34)[C@@H]1CC[C@@]2(O)C#C
:
Substrate
Name:
Estrogen receptor beta
Synonyms:
ER-beta ESR2_HUMAN Estradiol receptor beta (ERβ) Estrogen receptor (ER beta) Estrogen receptor beta (ER beta) NR3A2 estrogen beta
Type:
Protein
Mol. Mass.:
59238.43
Organism:
Homo sapiens (Human)
Description:
Q92731
Residue:
530