Target
RAC-alpha serine/threonine-protein kinase [139-480,S378A,S381A,T450D,S473D]
Ligand
BDBM16955
Substrate
biotinylated Akt peptide substrate
Meas. Tech.
Akt Kinase Assay
pH
7.5±n/a
Temperature
295.15±n/a K
IC50
4.6±n/a nM
Citation
 Zhu, GDGong, JClaiborne, AWoods, KWGandhi, VBThomas, SLuo, YLiu, XShi, YGuan, RMagnone, SRKlinghofer, VJohnson, EFBouska, JShoemaker, AOleksijew, AStoll, VSDe Jong, ROltersdorf, TLi, QRosenberg, SHGiranda, VL Isoquinoline-pyridine-based protein kinase B/Akt antagonists: SAR and in vivo antitumor activity. Bioorg Med Chem Lett 16:3150-5 (2006)  
Target
Name:
RAC-alpha serine/threonine-protein kinase [139-480,S378A,S381A,T450D,S473D]
Synonyms:
AKT1 C-AKT Protein kinase B (Akt 1) RAC | RAC-PK-alpha
Type:
Enzyme
Mol. Mass.:
39513.28
Organism:
Homo sapiens (Human)
Description:
Recombinant His-tagged Akt1 (S378A, S381A, T450D, S473D; 139-480)
Residue:
342
  
Inhibitor
Name:
BDBM16955
Synonyms:
5-[(2S)-2-amino-3-(1H-indol-3-yl)propoxy]-3-(isoquinolin-6-yl)pyridine-2-carbonitrile | Isoquinoline-pyridine, 10b
Type:
Small organic molecule
Emp. Form.:
C26H21N5O
Mol. Mass.:
419.4778
SMILES:
N[C@H](COc1cnc(C#N)c(c1)-c1ccc2cnccc2c1)Cc1c[nH]c2ccccc12
:
Substrate
Name:
biotinylated Akt peptide substrate
Synonyms:
Type:
Biotinylated Peptide
Mol. Mass.:
3178.04
Organism:
Description:
Km=15 uM
Residue:
28