Target
3-phosphoinositide-dependent protein kinase 1 [51-359]
Ligand
BDBM2694
Substrate
PDKtide
Meas. Tech.
PDK1 Kinase Activity Assay
pH
7.5±n/a
Temperature
303.15±n/a K
IC50
14000±n/a nM
Citation
 Komander, DKular, GSSchüttelkopf, AWDeak, MPrakash, KRBain, JElliott, MGarrido-Franco, MKozikowski, APAlessi, DRvan Aalten, DM Interactions of LY333531 and other bisindolyl maleimide inhibitors with PDK1. Structure 12:215-26 (2004)  
Target
Name:
3-phosphoinositide-dependent protein kinase 1 [51-359]
Synonyms:
3-Phosphoinositide-Dependent Protein Kinase 1 (PDK1) 3-phosphoinositide-dependent protein kinase 1 (aa 51-359) PDK1 (aa 51-359) PDPK1_HUMAN | hPDK1
Type:
Enzyme Catalytic Domain
Mol. Mass.:
35302.26
Organism:
Homo sapiens (Human)
Description:
O15530[51-359]
Residue:
309
  
Inhibitor
Name:
BDBM2694
Synonyms:
3-(1H-indol-3-yl)-4-{1-[2-(1-methylpyrrolidin-2-yl)ethyl]-1H-indol-3-yl}-2,5-dihydro-1H-pyrrole-2,5-dione Bisindolyl deriv. 22 | CHEMBL218328
Type:
Small organic molecule
Emp. Form.:
C27H26N4O2
Mol. Mass.:
438.5209
SMILES:
CN1CCCC1CCn1cc(C2=C(C(=O)NC2=O)c2c[nH]c3ccccc23)c2ccccc12
:
Substrate
Name:
PDKtide
Synonyms:
Synthetic PDK substrate peptide
Type:
Peptide
Mol. Mass.:
4766.24
Organism:
Description:
Residue:
39