Target
3-phosphoinositide-dependent protein kinase 1 [51-359,E166D]
Ligand
BDBM2691
Substrate
PDKtide
Meas. Tech.
PDK1 Kinase Activity Assay
pH
7.5±n/a
Temperature
303.15±n/a K
IC50
5700±n/a nM
Citation
 Komander, DKular, GSSchüttelkopf, AWDeak, MPrakash, KRBain, JElliott, MGarrido-Franco, MKozikowski, APAlessi, DRvan Aalten, DM Interactions of LY333531 and other bisindolyl maleimide inhibitors with PDK1. Structure 12:215-26 (2004)  
Target
Name:
3-phosphoinositide-dependent protein kinase 1 [51-359,E166D]
Synonyms:
3-Phosphoinositide-Dependent Protein Kinase 1 (PDK1) Mutant (E166D) PDK1 PDPK1_HUMAN | hPDK1
Type:
Kinase domain
Mol. Mass.:
35288.23
Organism:
Homo sapiens (Human)
Description:
The mutant enzyme was generated using site-directed mutagenesis and expressed as glutathione-S-transferase (GST) fusion proteins in insect cells.
Residue:
309
  
Inhibitor
Name:
BDBM2691
Synonyms:
3-[1-(3-aminopropyl)-1H-indol-3-yl]-4-(1H-indol-3-yl)-2,5-dihydro-1H-pyrrole-2,5-dione Bisindolyl deriv. 19
Type:
Small organic molecule
Emp. Form.:
C23H20N4O2
Mol. Mass.:
384.4305
SMILES:
NCCCn1cc(C2=C(C(=O)NC2=O)c2c[nH]c3ccccc23)c2ccccc12
:
Substrate
Name:
PDKtide
Synonyms:
Synthetic PDK substrate peptide
Type:
Peptide
Mol. Mass.:
4766.24
Organism:
Description:
Residue:
39