Target
Methionine aminopeptidase 2
Ligand
BDBM17436
Substrate
BDBM17353
Meas. Tech.
Enzyme Inhibition Assay
Ki
1.5±n/a nM
Citation
 Marino, JPFisher, PWHofmann, GAKirkpatrick, RBJanson, CAJohnson, RKMa, CMattern, MMeek, TDRyan, MDSchulz, CSmith, WWTew, DGTomazek, TAVeber, DFXiong, WCYamamoto, YYamashita, KYang, GThompson, SK Highly potent inhibitors of methionine aminopeptidase-2 based on a 1,2,4-triazole pharmacophore. J Med Chem 50:3777-85 (2007)  
Target
Name:
Methionine aminopeptidase 2
Synonyms:
Initiation factor 2-associated 67 kDa glycoprotein MAP2_HUMAN MNPEP Methionine aminopeptidase 2 (MetAP2) P67EIF2 p67
Type:
Enzyme
Mol. Mass.:
52884.45
Organism:
Homo sapiens (Human)
Description:
P50579
Residue:
478
  
Inhibitor
Name:
BDBM17436
Synonyms:
1,2,4-Triazole Compound, 94 | N-(5-{[(5-methyl-1,2-oxazol-3-yl)methyl]sulfanyl}-4H-1,2,4-triazol-3-yl)pyridin-3-amine
Type:
Small organic molecule
Emp. Form.:
C12H12N6OS
Mol. Mass.:
288.328
SMILES:
Cc1cc(CSc2nnc(Nc3cccnc3)[nH]2)no1
:
Substrate
Name:
BDBM17353
Synonyms:
(2S)-2-amino-N-(4-methyl-2-oxo-2H-chromen-7-yl)-4-(methylsulfanyl)butanamide Met-AMC
Type:
Small organic molecule
Emp. Form.:
C15H18N2O3S
Mol. Mass.:
306.38
SMILES:
CSCC[C@H](N)C(=O)Nc1ccc2c(C)cc(=O)oc2c1
: