Target
C-X-C chemokine receptor type 3
Ligand
BDBM228192
Substrate
Meas. Tech.
FLIPR Assay
pH
7.4±n/a
IC50
3.10±n/a nM
Comments
extracted
Citation
 Caroff, EMeyer, E (R)-2-methyl-piperazine derivatives as CXCR3 receptor modulators US Patent  US10047080 Publication Date 8/14/2018 
Target
Name:
C-X-C chemokine receptor type 3
Synonyms:
AAO92295.1 C-X-C chemokine receptor type 3 (CXCR3) CXCR3 CXCR3_HUMAN chemokine (C-X-C motif) receptor 3
Type:
Enzyme Catalytic Domain
Mol. Mass.:
40665.65
Organism:
Homo sapiens (Human)
Description:
Residue:
368
  
Inhibitor
Name:
BDBM228192
Synonyms:
1-{(R)-4-[4-(2-Cyclopropyl-pyrimidin-5-yl)-2-trifluoromethyl-thiazol-5-yl]-2-methyl-piperazin-1-yl}-2-(3-methoxymethyl-[1,2,4]triazol-1-yl)-ethanone | US10047080, 18
Type:
Small organic molecule
Emp. Form.:
C23H26F3N7O2S
Mol. Mass.:
521.558
SMILES:
COCc1ncn(CC(=O)N2C(C)CNCC2c2sc(cc2-c2cnc(nc2)C2CC2)C(F)(F)F)n1
: