Target
Androgen receptor
Ligand
BDBM18531
Substrate
BDBM18161
Meas. Tech.
AR Transcriptional Activation Assay and MDA Whole-Cell Binding Assay
pH
7.4±n/a
Temperature
310.15±n/a K
Ki
64±n/a nM
EC50
1.5±0.2 nM
Comments
hAR agonist efficacy = 72 +/- 5 %.
Citation
 van Oeveren, AMotamedi, MMani, NSMarschke, KBLópez, FJSchrader, WTNegro-Vilar, AZhi, L Discovery of 6-N,N-bis(2,2,2-trifluoroethyl)amino- 4-trifluoromethylquinolin-2(1H)-one as a novel selective androgen receptor modulator. J Med Chem 49:6143-6 (2006)  
Target
Name:
Androgen receptor
Synonyms:
ANDR_HUMAN Androgen Receptor Androgen receptor/Baculoviral IAP repeat-containing protein 2 Dihydrotestosterone receptor Nuclear receptor subfamily 3 group C member 4
Type:
Receptor
Mol. Mass.:
99185.27
Organism:
Homo sapiens (Human)
Description:
CHO cells were stably transfected with human AR gene.
Residue:
920
  
Inhibitor
Name:
BDBM18531
Synonyms:
6-(dipropylamino)-4-(trifluoromethyl)-1,2-dihydroquinolin-2-one | 6-dialkylamino-4-trifluoromethylquinolin-2(1H)-one, 4e
Type:
Small organic molecule
Emp. Form.:
C16H19F3N2O
Mol. Mass.:
312.3301
SMILES:
CCCN(CCC)c1ccc2[nH]c(=O)cc(c2c1)C(F)(F)F
:
Substrate
Name:
BDBM18161
Synonyms:
(1S,2S,7S,10R,11S,14S,15S)-14-hydroxy-2,15-dimethyltetracyclo[8.7.0.0^{2,7}.0^{11,15}]heptadecan-5-one CHEMBL27769 Dihydrotestosterone | [3H]DHT
Type:
Steroid
Emp. Form.:
C19H30O2
Mol. Mass.:
290.4403
SMILES:
[H][C@@]12CC[C@H](O)[C@@]1(C)CC[C@@]1([H])[C@@]2([H])CC[C@@]2([H])CC(=O)CC[C@]12C
: