Target
Androgen receptor
Ligand
BDBM18604
Substrate
BDBM18161
Meas. Tech.
AR Transcriptional Activation Assay and MDA Whole-Cell Binding Assay
Ki
21±n/a nM
IC50
2.0±n/a nM
EC50
9.1±n/a nM
Citation
 van Oeveren, AMotamedi, MMartinborough, EZhao, SShen, YWest, SChang, WKallel, AMarschke, KBLópez, FJNegro-Vilar, AZhi, L Novel selective androgen receptor modulators: SAR studies on 6-bisalkylamino-2-quinolinones. Bioorg Med Chem Lett 17:1527-31 (2007)  
Target
Name:
Androgen receptor
Synonyms:
ANDR_HUMAN Androgen Receptor Androgen receptor/Baculoviral IAP repeat-containing protein 2 Dihydrotestosterone receptor Nuclear receptor subfamily 3 group C member 4
Type:
Receptor
Mol. Mass.:
99185.27
Organism:
Homo sapiens (Human)
Description:
CHO cells were stably transfected with human AR gene.
Residue:
920
  
Inhibitor
Name:
BDBM18604
Synonyms:
6-[bis(2,2,2-trifluoroethyl)amino]-4-(propan-2-yl)-1,2-dihydroquinolin-2-one | 6-bisalkylamino-2-quinolinone, 7e
Type:
Small organic molecule
Emp. Form.:
C16H16F6N2O
Mol. Mass.:
366.3015
SMILES:
CC(C)c1cc(=O)[nH]c2ccc(cc12)N(CC(F)(F)F)CC(F)(F)F
:
Substrate
Name:
BDBM18161
Synonyms:
(1S,2S,7S,10R,11S,14S,15S)-14-hydroxy-2,15-dimethyltetracyclo[8.7.0.0^{2,7}.0^{11,15}]heptadecan-5-one CHEMBL27769 Dihydrotestosterone | [3H]DHT
Type:
Steroid
Emp. Form.:
C19H30O2
Mol. Mass.:
290.4403
SMILES:
[H][C@@]12CC[C@H](O)[C@@]1(C)CC[C@@]1([H])[C@@]2([H])CC[C@@]2([H])CC(=O)CC[C@]12C
: