Target
Glucocorticoid receptor
Ligand
BDBM18621
Substrate
BDBM18207
Meas. Tech.
GR-Mediated Agonist Activity Assay and IL-6 Repression Assay
pH
7.5±n/a
IC50
0.3±0.2 nM
EC50
0.6±0.3 nM
Comments
GRE activation agonist mode efficacy is 69 +/- 9.4 %.
Citation
 Hudson, ARRoach, SLHiguchi, RIPhillips, DPBissonnette, RPLamph, WWYen, JLi, YAdams, MEValdez, LJVassar, ACuervo, CKallel, EAGharbaoui, CJMais, DEMiner, JNMarschke, KBRungta, DNegro-Vilar, AZhi, L Synthesis and characterization of nonsteroidal glucocorticoid receptor modulators for multiple myeloma. J Med Chem 50:4699-709 (2007)  
Target
Name:
Glucocorticoid receptor
Synonyms:
GCR_HUMAN GRL Glucocorticoid receptor (GRFP) Nuclear receptor subfamily 3 group C member 1
Type:
Enzyme
Mol. Mass.:
85656.87
Organism:
Homo sapiens (Human)
Description:
P04150
Residue:
777
  
Inhibitor
Name:
BDBM18621
Synonyms:
1-(2-{[(18Z)-13-hydroxy-12-methoxy-3,5,5-trimethyl-17-oxa-6-azatetracyclo[8.8.0.0^{2,7}.0^{11,16}]octadeca-1(10),2(7),3,8,11,13,15-heptaen-18-ylidene]methyl}thiophen-3-yl)ethan-1-one | Ketone, 18
Type:
Small organic molecule
Emp. Form.:
C27H25NO4S
Mol. Mass.:
459.557
SMILES:
COc1c(O)ccc2OC(=Cc3sccc3C(C)=O)c3c(ccc4NC(C)(C)C=C(C)c34)-c12
:
Substrate
Name:
BDBM18207
Synonyms:
(1R,2S,10S,11S,13R,14R,15S,17S)-1-fluoro-14,17-dihydroxy-14-(2-hydroxyacetyl)-2,13,15-trimethyltetracyclo[8.7.0.0^{2,7}.0^{11,15}]heptadeca-3,6-dien-5-one US11554172, Compound Dexamethasone dexamethasone (tetramethyl-rhodamine conjugated )
Type:
Steroid
Emp. Form.:
C22H29FO5
Mol. Mass.:
392.4611
SMILES:
[H][C@@]12C[C@@H](C)[C@](O)(C(=O)CO)[C@@]1(C)C[C@H](O)[C@@]1(F)[C@@]2([H])CCC2=CC(=O)C=C[C@]12C
: