Target
Androgen receptor
Ligand
BDBM19242
Substrate
BDBM26258
Meas. Tech.
Competitive Radioligand Displacement Assay
pH
7.4±n/a
Temperature
277.15±n/a K
Ki
6.3±1.0 nM
Comments
IC50=66300 +/- 14900 for inhibiting growth of prostate cancer cell line, LNCaP.
Citation
 Hwang, DJYang, JXu, HRakov, IMMohler, MLDalton, JTMiller, DD Arylisothiocyanato selective androgen receptor modulators (SARMs) for prostate cancer. Bioorg Med Chem 14:6525-38 (2006)  
Target
Name:
Androgen receptor
Synonyms:
ANDR_RAT Ar Nr3c4 | androgen
Type:
Enzyme
Mol. Mass.:
98219.08
Organism:
Rattus norvegicus (Rat)
Description:
P15207
Residue:
902
  
Inhibitor
Name:
BDBM19242
Synonyms:
(2S)-N-[4-cyano-3-(trifluoromethyl)phenyl]-3-(3-fluoro-4-isothiocyanatophenoxy)-2-hydroxy-2-methylpropanamide | arylisothiocyanato derivative, S-26
Type:
Small organic molecule
Emp. Form.:
C19H13F4N3O3S
Mol. Mass.:
439.383
SMILES:
C[C@](O)(COc1ccc(N=C=S)c(F)c1)C(=O)Nc1ccc(C#N)c(c1)C(F)(F)F
:
Substrate
Name:
BDBM26258
Synonyms:
(1S,2R,9R,10R,11S,14S,15S)-14-hydroxy-9,14,15-trimethyltetracyclo[8.7.0.0^{2,7}.0^{11,15}]heptadec-6-en-5-one [3H]Mibolerone
Type:
radiolabeled ligand
Emp. Form.:
C20H30O2
Mol. Mass.:
302.451
SMILES:
[H][C@@]12CC[C@](C)(O)[C@@]1(C)CC[C@]1([H])[C@@]3([H])CCC(=O)C=C3C[C@@H](C)[C@@]21[H]
: