Target
Mitogen-activated protein kinase 1
Ligand
BDBM243985
Substrate
Meas. Tech.
Activated ERK2 Kinase Assay
pH
7.5±n/a
IC50
20962±n/a nM
Comments
extracted
Citation
 Dillon, MPLindvall, MPoon, DRamurthy, SRauniyar, VShafer, CSubramanian, STanner, HR Substituted pyrrolo[3,4-d]pyrimidines as kinase inhibitors US Patent  US9546173 Publication Date 1/17/2017 
Target
Name:
Mitogen-activated protein kinase 1
Synonyms:
ERK2 Extracellular signal-regulated kinase 2 Extracellular signal-regulated kinase 2 (ERK2) MAPK 2 MK01_HUMAN Mitogen-activated protein kinase 1 (ERK-2) Mitogen-activated protein kinase 2 PRKM2 | p42-MAPK
Type:
Ser/Thr Protein Kinase
Mol. Mass.:
41392.76
Organism:
Homo sapiens (Human)
Description:
P28482
Residue:
360
  
Inhibitor
Name:
BDBM243985
Synonyms:
(s)-n-(2-hydroxy-1-phenylethyl)-5,5-dimethyl-2-((1-methylpiperidin-4-yl)amino)-5h-pyrrolo[3,4-d]pyrimidine-6(7h)-carboxamide | US9546173, cmpd 61
Type:
Small organic molecule
Emp. Form.:
C23H32N6O2
Mol. Mass.:
424.5392
SMILES:
CN1CCC(CC1)Nc1ncc2c(CN(C(=O)N[C@H](CO)c3ccccc3)C2(C)C)n1
: