Target
Cathepsin S
Ligand
BDBM19620
Substrate
BDBM19546
Meas. Tech.
Enzyme Inhibition Assay
pH
5.5±n/a
Temperature
310.15±n/a K
Ki
19±n/a nM
Citation
 Tully, DCLiu, HAlper, PBChatterjee, AKEpple, RRoberts, MJWilliams, JANguyen, KTWoodmansee, DHTumanut, CLi, JSpraggon, GChang, JTuntland, THarris, JLKaranewsky, DS Synthesis and evaluation of arylaminoethyl amides as noncovalent inhibitors of cathepsin S. Part 3: heterocyclic P3. Bioorg Med Chem Lett 16:1975-80 (2006)  
Target
Name:
Cathepsin S
Synonyms:
CATS_HUMAN Cathepsin S (Cat S) | cathepsin S preproprotein
Type:
Protein
Mol. Mass.:
37507.38
Organism:
Homo sapiens (Human)
Description:
P25774
Residue:
331
  
Inhibitor
Name:
BDBM19620
Synonyms:
(2S)-2-[(7-chloro-1,3-benzoxazol-2-yl)amino]-3-cyclohexyl-N-{2-[(4-fluorophenyl)amino]ethyl}propanamide | Heterocyclic arylaminoethyl amide, 7f
Type:
Small organic molecule
Emp. Form.:
C24H28ClFN4O2
Mol. Mass.:
458.956
SMILES:
Fc1ccc(NCCNC(=O)[C@H](CC2CCCCC2)Nc2nc3cccc(Cl)c3o2)cc1
:
Substrate
Name:
BDBM19546
Synonyms:
7-amino-3-carbamoylmethyl-4-methyl coumarin labeled fluorescent peptide | Ac-His-Pro-Val-Lys-ACMC
Type:
Emp. Form.:
Mol. Mass.:
SMILES:
: