Target
Cathepsin S
Ligand
BDBM19627
Substrate
BDBM19546
Meas. Tech.
Enzyme Inhibition Assay
pH
5.5±n/a
Temperature
310.15±n/a K
Ki
3±n/a nM
Citation
 Tully, DCLiu, HAlper, PBChatterjee, AKEpple, RRoberts, MJWilliams, JANguyen, KTWoodmansee, DHTumanut, CLi, JSpraggon, GChang, JTuntland, THarris, JLKaranewsky, DS Synthesis and evaluation of arylaminoethyl amides as noncovalent inhibitors of cathepsin S. Part 3: heterocyclic P3. Bioorg Med Chem Lett 16:1975-80 (2006)  
Target
Name:
Cathepsin S
Synonyms:
CATS_HUMAN Cathepsin S (Cat S) | cathepsin S preproprotein
Type:
Protein
Mol. Mass.:
37507.38
Organism:
Homo sapiens (Human)
Description:
P25774
Residue:
331
  
Inhibitor
Name:
BDBM19627
Synonyms:
(2S)-2-[(7-chloro-1,3-benzoxazol-2-yl)amino]-3-cyclohexyl-N-[(2S)-1-(5-fluoro-3,3-dimethyl-2,3-dihydro-1H-indol-1-yl)propan-2-yl]propanamide | Heterocyclic arylaminoethyl amide, 12f
Type:
Small organic molecule
Emp. Form.:
C29H36ClFN4O2
Mol. Mass.:
527.073
SMILES:
C[C@@H](CN1CC(C)(C)c2cc(F)ccc12)NC(=O)[C@H](CC1CCCCC1)Nc1nc2cccc(Cl)c2o1
:
Substrate
Name:
BDBM19546
Synonyms:
7-amino-3-carbamoylmethyl-4-methyl coumarin labeled fluorescent peptide | Ac-His-Pro-Val-Lys-ACMC
Type:
Emp. Form.:
Mol. Mass.:
SMILES:
: