Target
Procathepsin L
Ligand
BDBM19677
Substrate
BDBM19584
Meas. Tech.
Enzyme Inhibition Assay
Ki
>30000±n/a nM
Citation
 Tully, DCLiu, HChatterjee, AKAlper, PBWilliams, JARoberts, MJMutnick, DWoodmansee, DHHollenbeck, TGordon, PChang, JTuntland, TTumanut, CLi, JHarris, JLKaranewsky, DS Arylaminoethyl carbamates as a novel series of potent and selective cathepsin S inhibitors. Bioorg Med Chem Lett 16:5107-11 (2006)  
Target
Name:
Procathepsin L
Synonyms:
CATL1_HUMAN CTSL CTSL1 Cathepsin L Cathepsin L1 heavy chain MEP cathepsin L preproprotein
Type:
Enzyme
Mol. Mass.:
37557.19
Organism:
Homo sapiens (Human)
Description:
Purchased from Calbiochem (San Diego, CA).
Residue:
333
  
Inhibitor
Name:
BDBM19677
Synonyms:
(2S)-3-cyclohexyl-1-(morpholin-4-yl)-1-oxopropan-2-yl N-[2-(5-fluoro-2,3-dihydro-1H-indol-1-yl)ethyl]carbamate | Arylaminoethyl carbamate, 8
Type:
Small organic molecule
Emp. Form.:
C24H34FN3O4
Mol. Mass.:
447.5429
SMILES:
Fc1ccc2N(CCNC(=O)O[C@@H](CC3CCCCC3)C(=O)N3CCOCC3)CCc2c1
:
Substrate
Name:
BDBM19584
Synonyms:
7-amino-3-carbamoylmethyl-4-methyl coumarin labeled fluorescent peptide | Ac-His-Lys-Phe-Lys-ACMC
Type:
Emp. Form.:
Mol. Mass.:
SMILES:
: