Target
Procathepsin L
Ligand
BDBM19762
Substrate
BDBM19485
Meas. Tech.
Enzyme Inhibition Assay
pH
5.5±n/a
Temperature
295.15±n/a K
IC50
<30±n/a nM
Citation
 Altmann, EAichholz, RBetschart, CBuhl, TGreen, JLattmann, RMissbach, M Dipeptide nitrile inhibitors of cathepsin K. Bioorg Med Chem Lett 16:2549-54 (2006)  
Target
Name:
Procathepsin L
Synonyms:
CATL1_HUMAN CTSL CTSL1 Cathepsin L Cathepsin L1 heavy chain MEP cathepsin L preproprotein
Type:
Enzyme
Mol. Mass.:
37557.19
Organism:
Homo sapiens (Human)
Description:
Purchased from Calbiochem (San Diego, CA).
Residue:
333
  
Inhibitor
Name:
BDBM19762
Synonyms:
(2S)-N-[(1R)-2-(benzyloxy)-1-cyanoethyl]-2-[2-(4-chlorophenoxy)-2-methylpropanamido]-4-methylpentanamide | dipeptidyl nitrile, 16c
Type:
Small organic molecule
Emp. Form.:
C26H32ClN3O4
Mol. Mass.:
486.003
SMILES:
CC(C)C[C@H](NC(=O)C(C)(C)Oc1ccc(Cl)cc1)C(=O)N[C@@H](COCc1ccccc1)C#N
:
Substrate
Name:
BDBM19485
Synonyms:
Cbz-Phe-Arg-AMC Z-Phe-Arg-AMC.HCl
Type:
Emp. Form.:
Mol. Mass.:
SMILES:
: