Target
Cathepsin S
Ligand
BDBM19758
Substrate
BDBM19963
Meas. Tech.
Enzyme Inhibition Assay
IC50
900±n/a nM
Citation
 Altmann, EAichholz, RBetschart, CBuhl, TGreen, JLattmann, RMissbach, M Dipeptide nitrile inhibitors of cathepsin K. Bioorg Med Chem Lett 16:2549-54 (2006)  
Target
Name:
Cathepsin S
Synonyms:
CATS_HUMAN Cathepsin S (Cat S) | cathepsin S preproprotein
Type:
Protein
Mol. Mass.:
37507.38
Organism:
Homo sapiens (Human)
Description:
P25774
Residue:
331
  
Inhibitor
Name:
BDBM19758
Synonyms:
benzyl N-[(1S)-1-{[(1R)-2-(tert-butoxy)-1-cyanoethyl]carbamoyl}-3-methylbutyl]carbamate | dipeptidyl nitrile, 5g
Type:
Small organic molecule
Emp. Form.:
C21H31N3O4
Mol. Mass.:
389.4885
SMILES:
CC(C)C[C@H](NC(=O)OCc1ccccc1)C(=O)N[C@@H](COC(C)(C)C)C#N
:
Substrate
Name:
BDBM19963
Synonyms:
Cbz-Leu-Leu-Arg-AMC Z-Leu-Leu-Arg-AMC
Type:
Emp. Form.:
Mol. Mass.:
SMILES:
: