Target
Estrogen receptor beta
Ligand
BDBM19964
Substrate
17beta-estradiol (E2)
Meas. Tech.
Estrogen Receptor Binding Assay and Ishikawa Assay
pH
7.5±n/a
Temperature
295.15±n/a K
Ki
0.7±0.34 nM
EC50
1.14±0.56 nM
Citation
 Hummel, CWGeiser, AGBryant, HUCohen, IRDally, RDFong, KCFrank, SAHinklin, RJones, SALewis, GMcCann, DJRudmann, DGShepherd, TATian, HWallace, OBWang, MWang, YDodge, JA A selective estrogen receptor modulator designed for the treatment of uterine leiomyoma with unique tissue specificity for uterus and ovaries in rats. J Med Chem 48:6772-5 (2005)  
Target
Name:
Estrogen receptor beta
Synonyms:
ER-beta ESR2_HUMAN Estradiol receptor beta (ERβ) Estrogen receptor (ER beta) Estrogen receptor beta (ER beta) NR3A2 estrogen beta
Type:
Protein
Mol. Mass.:
59238.43
Organism:
Homo sapiens (Human)
Description:
Q92731
Residue:
530
  
Inhibitor
Name:
BDBM19964
Synonyms:
6-(4-hydroxyphenyl)-5-({4-[2-(piperidin-1-yl)ethoxy]phenyl}methyl)naphthalen-2-ol LY326315
Type:
Small organic molecule
Emp. Form.:
C30H31NO3
Mol. Mass.:
453.572
SMILES:
Oc1ccc(cc1)-c1ccc2cc(O)ccc2c1Cc1ccc(OCCN2CCCCC2)cc1
:
Substrate
Name:
BDBM17292
Synonyms:
(1S,10R,11S,14S,15S)-15-methyltetracyclo[8.7.0.0^{2,7}.0^{11,15}]heptadeca-2,4,6-triene-5,14-diol 17α-ethinylestradiol CHEMBL135 ESTRADIOL Ovocyclin US9040509, E2 US9561238, E2 [2,4,6,7-3H]-E2 [3H]]estradiol
Type:
Steroid
Emp. Form.:
C18H24O2
Mol. Mass.:
272.382
SMILES:
[H][C@@]12CC[C@H](O)[C@@]1(C)CC[C@]1([H])c3ccc(O)cc3CC[C@@]21[H]
: