Target
Cathepsin S
Ligand
BDBM20111
Substrate
BDBM20129
Meas. Tech.
Papain Inhibition Assay
Ki
300±n/a nM
Citation
 Löser, RSchilling, KDimmig, EGütschow, M Interaction of papain-like cysteine proteases with dipeptide-derived nitriles. J Med Chem 48:7688-707 (2005)  
Target
Name:
Cathepsin S
Synonyms:
CATS_HUMAN Cathepsin S (Cat S) | cathepsin S preproprotein
Type:
Protein
Mol. Mass.:
37507.38
Organism:
Homo sapiens (Human)
Description:
P25774
Residue:
331
  
Inhibitor
Name:
BDBM20111
Synonyms:
dipeptide-derived nitrile, 32 | tert-butyl N-[(1S)-2-(1-benzothiophen-3-yl)-1-[(cyanomethyl)carbamoyl]ethyl]carbamate
Type:
Small organic molecule
Emp. Form.:
C18H21N3O3S
Mol. Mass.:
359.443
SMILES:
CC(C)(C)OC(=O)N[C@@H](Cc1csc2ccccc12)C(=O)NCC#N
:
Substrate
Name:
BDBM20129
Synonyms:
Z-Val-Val-Arg-NH-4-methylcoumarin-7-yl | Z-Val-Val-Arg-NHMec
Type:
Emp. Form.:
Mol. Mass.:
SMILES:
: