Target
Transporter
Ligand
BDBM364425
Substrate
Meas. Tech.
Norepinephrine Transporter Binding Assay
Ki
>100000±n/a nM
Citation
 Newman, AHOkunola-Bakare, OMCao, J Potent and selective inhibitors of monoamine transporters; method of making; and use thereof US Patent  US9862679 Publication Date 1/9/2018 
Target
Name:
Transporter
Synonyms:
NE transporter Norepinephrine transporter(NET)
Type:
Multi-pass membrane protein
Mol. Mass.:
69236.90
Organism:
Rattus norvegicus (rat)
Description:
Q63380
Residue:
617
  
Inhibitor
Name:
BDBM364425
Synonyms:
US10913711, Compound 10d US9862679, Compound 10d
Type:
Small organic molecule
Emp. Form.:
C22H28F2N2O2S
Mol. Mass.:
422.532
SMILES:
CC(O)CN1CCN(CCS(=O)C(c2ccc(F)cc2)c2ccc(F)cc2)CC1
: