Target
Estrogen receptor
Ligand
BDBM20615
Substrate
17beta-estradiol (E2)
Meas. Tech.
ER-alpha Radioligand Binding Assay and ERE-Luciferase Reporter Assay.
pH
7.4±n/a
Temperature
295.15±n/a K
IC50
87±24 nM
EC50
46.1±6.9 nM
Comments
Antagonist activity in MCF-7 assay, IC50= 46 +/- 15 nM, 100% antagonism; in the absence of 17beta-estradiol in the MCF-7 proliferation assay, compound displayed 12 +/- 5 % agonistic effect.
Citation
 Renaud, JBischoff, SFBuhl, TFloersheim, PFournier, BGeiser, MHalleux, CKallen, JKeller, HRamage, P Selective estrogen receptor modulators with conformationally restricted side chains. Synthesis and structure-activity relationship of ERalpha-selective tetrahydroisoquinoline ligands. J Med Chem 48:364-79 (2005)  
Target
Name:
Estrogen receptor
Synonyms:
ER ESR ESR1_HUMAN Estrogen receptor Estrogen receptor (ER-alpha) Estrogen receptor alpha (ER) Nuclear receptor subfamily 3 group A member 1
Type:
Protein
Mol. Mass.:
66230.44
Organism:
Homo sapiens (Human)
Description:
P03372
Residue:
595
  
Inhibitor
Name:
BDBM20615
Synonyms:
2-(4-fluorophenyl)-1-[4-(1-methylpiperidin-4-yl)phenyl]-1,2,3,4-tetrahydroisoquinolin-6-ol | Piperidine Derivative, 38b
Type:
Small organic molecule
Emp. Form.:
C27H29FN2O
Mol. Mass.:
416.5304
SMILES:
CN1CCC(CC1)c1ccc(cc1)C1N(CCc2cc(O)ccc12)c1ccc(F)cc1
:
Substrate
Name:
BDBM17292
Synonyms:
(1S,10R,11S,14S,15S)-15-methyltetracyclo[8.7.0.0^{2,7}.0^{11,15}]heptadeca-2,4,6-triene-5,14-diol 17α-ethinylestradiol CHEMBL135 ESTRADIOL Ovocyclin US9040509, E2 US9561238, E2 [2,4,6,7-3H]-E2 [3H]]estradiol
Type:
Steroid
Emp. Form.:
C18H24O2
Mol. Mass.:
272.382
SMILES:
[H][C@@]12CC[C@H](O)[C@@]1(C)CC[C@]1([H])c3ccc(O)cc3CC[C@@]21[H]
: