Target
Programmed cell death 1 ligand 1
Ligand
BDBM365878
Substrate
Meas. Tech.
Homogenous Time-Resolved Fluorescence (HTRF) Binding Assay
IC50
555±n/a nM
Citation
 Chupak, LSZheng, X Compounds useful as immunomodulators US Patent  US9872852 Publication Date 1/23/2018 
Target
Name:
Programmed cell death 1 ligand 1
Synonyms:
B7 homolog 1 B7H1 CD274 PD-L1 PDCD1 ligand 1 PDCD1LG1 Programmed cell death 1 ligand 1 | Programmed death ligand 1
Type:
PROTEIN
Mol. Mass.:
33278.49
Organism:
Homo sapiens (Human)
Description:
ChEMBL_109807
Residue:
290
  
Inhibitor
Name:
BDBM365878
Synonyms:
2-(3,5-dimethoxy-4-{[(pyridin-4- ylmethyl)amino]methyl} phenoxymethyl)- 6-phenylbenzonitrile | US9872852, Example 130
Type:
Small organic molecule
Emp. Form.:
C29H27N3O3
Mol. Mass.:
465.543
SMILES:
COc1cc(OCc2cccc(-c3ccccc3)c2C#N)cc(OC)c1CNCc1ccncc1
: