Target
Heat shock protein HSP 90-beta
Ligand
BDBM20764
Substrate
BDBM10852
Meas. Tech.
Her-2 Degradation Assay
pH
7.2±n/a
Temperature
310.15±n/a K
EC50
100000±n/a nM
Comments
EC50=16000 nM in MTS cell-growth inhibition assay.
Citation
 Zhang, LFan, JVu, KHong, KLe Brazidec, JYShi, JBiamonte, MBusch, DJLough, REGrecko, RRan, YSensintaffar, JLKamal, ALundgren, KBurrows, FJMansfield, RTimony, GAUlm, EHKasibhatla, SRBoehm, MF 7'-substituted benzothiazolothio- and pyridinothiazolothio-purines as potent heat shock protein 90 inhibitors. J Med Chem 49:5352-62 (2006)  
Target
Name:
Heat shock protein HSP 90-beta
Synonyms:
HS90B_HUMAN HSP 90 HSP90B HSPCB Heat shock protein HSP 90 (Hsp90)
Type:
Molecular Chaperone
Mol. Mass.:
83229.45
Organism:
Homo sapiens (Human)
Description:
P08238
Residue:
724
  
Inhibitor
Name:
BDBM20764
Synonyms:
9-butyl-8-[(7-ethoxy-1,3-benzothiazol-2-yl)sulfanyl]-9H-purin-6-amine | Benzothiazole analogue, 17
Type:
Small organic molecule
Emp. Form.:
C18H20N6OS2
Mol. Mass.:
400.521
SMILES:
CCCCn1c(Sc2nc3cccc(OCC)c3s2)nc2c(N)ncnc12
:
Substrate