Target
Alpha-1,6-mannosyl-glycoprotein 2-beta-N-acetylglucosaminyltransferase
Ligand
BDBM247150
Substrate
Meas. Tech.
MGAT LCMS Assay
pH
7.4±n/a
IC50
1.10±n/a nM
Comments
extracted
Citation
 Meng, WZhao, G Dihydropyridinone MGAT2 inhibitors for use in the treatment of metabolic disorders US Patent  US9701672 Publication Date 7/11/2017 
Target
Name:
Alpha-1,6-mannosyl-glycoprotein 2-beta-N-acetylglucosaminyltransferase
Synonyms:
2.4.1.143 GNT-II MGAT2 Mannoside acetylglucosaminyltransferase 2 Monoacylglycerol acyltransferase type 2 (h-MGAT2) h-MGAT2 (human monoacylglycerol acyltransferase type 2)
Type:
Mol. Mass.:
51567.80
Organism:
Homo sapiens (Human)
Description:
Q10469
Residue:
447
  
Inhibitor
Name:
BDBM247150
Synonyms:
(S,E)-2-Methyl-N-(2,2,2-trifluoro-1-(4-((5,5,5-trifluoropentyl)oxy phenyl)ethylidene)propane-2-sulfinamide US9701672, 54
Type:
Small organic molecule
Emp. Form.:
C24H20F7N5O2S
Mol. Mass.:
575.502
SMILES:
Fc1cc(OCCCC(F)(F)F)ccc1[C@@]1(CC(c2ccc(s2)C2CC2)=C(c2nnn[nH]2)C(=O)N1)C(F)(F)F
: